{"text_format":"1","workbook":"xlsx","n_sheets":3,"sheets":["F1. EVAL. LNR","F2. EVIDENCIAS","Hoja4"],"not_rendered":{"charts":0,"images":2,"macros":1,"external_links":1,"defined_names":51,"comments":1,"pivot_tables":0},"unopened":[],"bounds":{"document_bytes":16777216,"sheet_cells":100000,"rows_first":2000,"rows_last":500,"rows_between":2000,"halvings":0,"cell_chars":16384,"cell_head_chars":4096},"cells_cut":0,"cells_raw":0,"read":"whole","date_system":"1900"}

{"sheet":"F1. EVAL. LNR","index":0,"n_rows":57,"n_cols":16,"rows_kept":57,"cut":false,"hidden":false,"merged":[[29,15,31,15],[54,4,56,6],[56,7,56,10],[56,13,56,15],[9,8,9,15],[32,12,32,13],[16,6,16,11],[16,0,16,5],[17,11,18,12],[51,0,52,1],[51,2,52,3],[51,4,52,5],[51,6,52,7],[51,8,52,9],[50,0,50,15],[27,13,27,14],[28,13,28,14],[29,13,29,14],[30,13,30,14],[31,13,31,14],[53,0,53,15],[51,10,52,11],[51,14,52,15],[54,11,56,12],[3,12,4,12],[17,13,18,15],[34,13,34,14],[46,9,46,15],[51,12,52,13],[35,13,35,14],[36,13,36,14],[37,13,37,14],[38,13,38,14],[39,13,39,14],[40,13,40,14],[41,13,41,14],[42,13,42,14],[43,13,43,14],[22,13,22,14],[23,13,23,14],[24,13,24,14],[25,13,25,14],[26,13,26,14],[45,0,45,15],[46,0,47,1],[48,0,49,1],[48,7,49,8],[16,14,16,15],[43,0,43,11],[44,0,44,11],[39,0,40,1],[39,2,40,4],[39,5,40,11],[39,15,40,15],[41,0,42,1],[41,2,42,4],[41,5,42,11],[41,15,42,15],[43,12,44,12],[44,13,44,14],[43,15,44,15],[54,0,56,1],[46,7,47,8],[48,9,49,11],[47,14,47,15],[48,12,49,12],[48,13,49,13],[48,14,49,15],[54,13,55,15],[46,2,46,6],[56,2,56,3],[54,2,55,3],[54,7,55,10],[35,0,36,1],[35,2,36,4],[35,5,36,11],[35,15,36,15],[37,0,38,1],[37,2,38,4],[37,5,38,11],[37,15,38,15],[33,0,33,15],[34,0,34,1],[34,2,34,4],[34,5,34,11],[31,5,31,10],[32,0,32,9],[32,10,32,11],[28,0,28,4],[28,5,28,9],[28,10,28,11],[29,0,29,9],[29,10,29,11],[30,0,31,4],[30,5,30,10],[27,0,27,4],[27,5,27,9],[27,10,27,11],[19,0,19,15],[20,0,23,4],[20,5,23,9],[20,10,23,11],[20,12,20,15],[22,15,23,15],[25,10,25,11],[26,10,26,11],[26,0,26,4],[17,10,18,10],[15,0,15,5],[15,6,15,11],[15,14,15,15],[13,11,13,12],[14,11,14,12],[24,0,24,4],[24,5,24,9],[24,10,24,11],[17,0,18,4],[17,5,18,5],[17,6,18,9],[9,0,9,7],[10,0,10,4],[10,5,10,6],[10,8,11,9],[10,10,11,15],[11,0,11,4],[11,5,11,6],[14,0,14,1],[14,2,14,4],[14,5,14,7],[14,8,14,10],[14,13,14,15],[12,0,12,15],[13,0,13,1],[13,2,13,4],[13,5,13,7],[13,8,13,10],[13,13,13,15],[32,14,32,15],[3,0,4,3],[3,7,4,8],[0,0,2,3],[0,4,1,12],[2,4,2,12],[25,0,25,4],[25,5,25,9],[26,5,26,9],[5,0,5,15],[6,0,6,1],[6,2,6,4],[6,5,6,7],[6,8,6,10],[6,11,6,12],[6,13,6,15],[8,0,8,7],[8,8,8,15],[7,0,7,1],[7,2,7,4],[7,5,7,7],[7,8,7,10],[7,11,7,12],[7,13,7,15]]}
[null,null,null,null,"FORMATO 1.  EVALUACIÓN DEL DESEMPEÑO LABORAL\nSERVIDORES PÚBLICOS DE LIBRE NOMBRAMIENTO Y REMOCIÓN",null,null,null,null,null,null,null,null,"Código:","F-TH-70"]
[null,null,null,null,null,null,null,null,null,null,null,null,null,"Versión: 01"]
[null,null,null,null,"PROCESO: GESTIÓN DEL TALENTO HUMANO",null,null,null,null,null,null,null,null,"Página 1 de 1"]
["PERÍODO DE EVALUACIÓN",null,null,null,"DÍA","MES","AÑO","al",null,"DÍA","MES","AÑO","FECHA DE CONCERTACIÓN / EVALUACIÓN","DÍA","MES","AÑO"]
[]
["I. IDENTIFICACIÓN DEL EVALUADO"]
["Tipo de Documento",null,"Número de identificación",null,null,"Primer apellido",null,null,"Segundo apellido",null,null,"Primer nombre",null,"Otros nombres"]
["CEDULA DE CIUDADANIA"]
["Dependencia o área a la que pertenece el evaluado",null,null,null,null,null,null,null,"Denominación del empleo"]
[]
["Nivel jerárquico",null,null,null,null,"Código",null,"Grado","Propósito del empleo:  "]
[]
["II. IDENTIFICACIÓN EVALUADOR. (Jefe inmediato del evaluado )"]
["Tipo de documento",null,"Número de identificación",null,null,"Primer apellido",null,null,"Segundo apellido",null,null,"Primer nombre",null,"Otros nombres"]
["CEDULA DE CIUDADANIA"]
[" Área o Dependencia a la que pertenece el evaluador",null,null,null,null,null,"Denominación del empleo",null,null,null,null,null,"Código","Grado","Nivel jerárquico"]
[]
["CONCERTACIÓN COMPROMISOS",null,null,null,null,"X","EVALUACIÓN",null,null,null,null,"TIPO DE EVALUACIÓN"]
[]
["III. COMPROMISOS FUNCIONALES (Concertar de 3 a 5 compromisos)"]
["Metas del Área o Dependencia a las cuales contribuye el empleo",null,null,null,null,"Compromisos Funcionales",null,null,null,null,"Peso porcentual del compromiso"]
[null,null,null,null,null,null,null,null,null,null,null,null,"Separación temporal del empleo por más de 30 días calendario"]
[null,null,null,null,null,null,null,null,null,null,null,null,"Desde (dd/mm/aaaa)",null,null,"Total"]
[null,null,null,null,null,null,null,null,null,null,null,null,"Hasta\n(dd/mm/aaaa)"]
[null,null,null,null,null,null,null,null,null,null,null,null,null,null,null,{"$f":"IF($L$31=\"\",0,SUM(($K25*M25*M$32),,(K25*N25*N$32),(K25*O25*O$32)))","v":0}]
[null,null,null,null,null,null,null,null,null,null,null,null,null,null,null,{"$f":"IF($L$31=\"\",0,SUM(($K26*M26*M$32),,(K26*N26*N$32),(K26*O26*O$32)))","v":0}]
[null,null,null,null,null,null,null,null,null,null,null,null,null,null,null,{"$f":"IF($L$31=\"\",0,SUM(($K27*M27*M$32),,(K27*N27*N$32),(K27*O27*O$32)))","v":0}]
[null,null,null,null,null,null,null,null,null,null,null,null,null,null,null,{"$f":"IF($L$31=\"\",0,SUM(($K28*M28*M$32),,(K28*N28*N$32),(K28*O28*O$32)))","v":0}]
[null,null,null,null,null,null,null,null,null,null,null,null,null,null,null,{"$f":"IF($L$31=\"\",0,SUM(($K29*M29*M$32),,(K29*N29*N$32),(K29*O29*O$32)))","v":0}]
["TOTALES",null,null,null,null,null,null,null,null,null,{"$f":"IF(COUNT(K25:L29)<3,\"DETERMINAR TRES (03) COMPROMISOS\",IF(SUM(K25:L29)>1,CONCATENATE(\"ERROR!!: Sumatoria mayor a 100% (\",TEXT(SUM(K25:L29),\"0%)\")),IF(SUM(K25:L29)<1,CONCATENATE(\"ERROR!!: Sumatoria menor a 100% (\",TEXT(SUM(K25:L29),\"0%)\")),SUM(K25:L29))))","v":"DETERMINAR TRES (03) COMPROMISOS"},null,null,{"$f":"IF(N31=\"\",0,(N25*$K25+N26*$K26+N27*$K27+N28*$K28+N29*$K29))","v":0},null,{"$f":"ROUND(IF($L$31=0,0,SUM(($K30*M30*M$32),(K30*N30*N$32),(K30*O30*O$32))),2)","v":0}]
["Días Efectivamente Laborados",null,null,null,null,"Total Días Laborados Evaluados",null,null,null,null,null,{"$f":"IF(SUM(M31:O31)>360,\"No Aplica\",SUM(M31:O31))","v":0},null,{"$f":"DAYS360(N23,N24)","v":0}]
[null,null,null,null,null,"% Participación Días Evaluados",null,null,null,null,null,{"$f":"IFERROR(+L31/$L$31,0)","v":0},null,{"$f":"IFERROR(+N31/$L$31,0)","v":0}]
["CALIFICACIÓN COMPROMISOS FUNCIONALES (Sobre 100)",null,null,null,null,null,null,null,null,null,{"$f":"IF(AND(K30=1,L32=1)=TRUE,(M30*M32+N30*N32+O30*O32),\"NO APLICA\")","v":"NO APLICA"},null,"CALIFICACIÓN FUNCIONALES\n(Sobre 85%)",null,{"$f":"IFERROR((K33*85%),\"NO APLICA\")","v":"NO APLICA"}]
["IV. COMPETENCIAS COMPORTAMENTALES (concertar 4 competencias)"]
["COMPETENCIA",null,"DEFINICIÓN ",null,null,"CONDUCTAS ASOCIADAS",null,null,null,null,null,null,null,"CALIFICACIÓN",null,"Total"]
[null,null,{"$f":"IFERROR(VLOOKUP($A$12&A36,Hoja4!C$601:E$654,2,FALSE),\"\")","v":""},null,null,{"$f":"IF(AND(A36<>A38,A36<>A40,A36<>A42)=TRUE,VLOOKUP($A$12&A36,Hoja4!C$601:E$654,3,FALSE),\"REPETIDA\")","v":"REPETIDA"},null,null,null,null,null,null,null,null,null,{"$f":"IFERROR((SUM(IF($M$45>0,M37*$M$45,0),IF($N$45>0,N37*$N$45,0),IF($O$45>0,O37*$O$45,0))),\"FALTAN CALIFICACIONES\")","v":0}]
[null,null,null,null,null,null,null,null,null,null,null,null,{"$f":"IF($A$36<>0,IFERROR(VLOOKUP(M36,Hoja4!$A$460:$B$464,2,FALSE),\"\"),\"DEFINA COMPETENCIA\")","v":"DEFINA COMPETENCIA"},{"$f":"IF($A$36<>0,IFERROR(VLOOKUP(N36,Hoja4!$A$460:$B$464,2,FALSE),\"\"),\"DEFINA COMPETENCIA\")","v":"DEFINA COMPETENCIA"}]
[null,null,{"$f":"IFERROR(VLOOKUP($A$12&A38,Hoja4!C$601:E$654,2,FALSE),\"\")","v":""},null,null,{"$f":"IF(AND(A38<>A36,A38<>A40,A38<>A42)=TRUE,VLOOKUP($A$12&A38,Hoja4!C$601:E$654,3,FALSE),\"REPETIDA\")","v":"REPETIDA"},null,null,null,null,null,null,null,null,null,{"$f":"IFERROR((SUM(IF($M$45>0,M39*$M$45,0),,IF($N$45>0,N39*$N$45,0),IF($O$45>0,O39*$O$45,0))),\"FALTAN CALIFICACIONES\")","v":0}]
[null,null,null,null,null,null,null,null,null,null,null,null,{"$f":"IF($A$38<>0,IFERROR(VLOOKUP(M38,Hoja4!$A$460:$B$464,2,FALSE),\"\"),\"DEFINA COMPETENCIA\")","v":"DEFINA COMPETENCIA"},{"$f":"IF($A$38<>0,IFERROR(VLOOKUP(N38,Hoja4!$A$460:$B$464,2,FALSE),\"\"),\"DEFINA COMPETENCIA\")","v":"DEFINA COMPETENCIA"}]
[null,null,{"$f":"IFERROR(VLOOKUP($A$12&A40,Hoja4!C$601:E$654,2,FALSE),\"\")","v":""},null,null,{"$f":"IF(AND(A40<>A36,A40<>A38,A40<>A42)=TRUE,VLOOKUP($A$12&A40,Hoja4!C$601:E$654,3,FALSE),\"REPETIDA\")","v":"REPETIDA"},null,null,null,null,null,null,null,null,null,{"$f":"IFERROR((SUM(IF($M$45>0,M41*$M$45,0),,IF($N$45>0,N41*$N$45,0),IF($O$45>0,O41*$O$45,0))),\"FALTAN CALIFICACIONES\")","v":0}]
{"$rows_left_out":18}
{"sheet":"F2. EVIDENCIAS","index":1,"n_rows":80,"n_cols":18,"rows_kept":80,"cut":false,"hidden":false,"merged":[[15,17,15,18],[35,13,39,14],[40,13,44,14],[45,13,49,14],[50,13,54,14],[70,7,74,12],[70,13,74,14],[55,16,59,16],[60,16,64,16],[25,13,29,14],[30,13,34,14],[22,7,24,12],[25,7,29,12],[30,7,34,12],[16,0,16,18],[17,0,17,1],[17,2,17,4],[17,5,17,7],[17,8,17,10],[17,11,17,14],[17,15,17,18],[22,16,24,16],[20,0,20,5],[70,0,74,1],[14,17,14,18],[5,5,5,7],[5,8,5,10],[5,11,5,14],[5,15,5,18],[6,0,6,1],[6,2,6,4],[6,5,6,7],[6,8,6,10],[6,11,6,14],[6,15,6,18],[14,6,14,12],[12,2,12,4],[12,5,12,7],[12,8,12,10],[13,15,13,18],[14,0,14,5],[12,15,12,18],[12,11,12,14],[14,15,14,16],[0,0,0,18],[7,0,7,7],[7,8,7,18],[8,0,8,7],[15,6,15,12],[15,13,15,14],[15,15,15,16],[9,0,9,4],[8,8,8,18],[14,13,14,14],[13,0,13,1],[13,2,13,4],[10,0,10,4],[10,5,10,6],[11,0,11,18],[9,5,9,6],[12,0,12,1],[4,0,4,18],[5,0,5,1],[5,2,5,4],[9,10,10,18],[13,5,13,7],[13,8,13,10],[13,11,13,14],[18,0,18,1],[18,2,18,4],[18,5,18,7],[18,8,18,10],[18,11,18,14],[18,15,18,18],[19,0,19,5],[19,6,19,12],[19,13,19,14],[19,15,19,16],[19,17,19,18],[20,17,20,18],[20,6,20,12],[20,13,20,14],[40,17,44,18],[70,17,74,18],[21,0,21,18],[30,17,34,18],[22,17,24,18],[22,2,24,6],[22,0,24,1],[65,13,69,14],[65,16,69,16],[35,0,39,1],[40,0,44,1],[45,0,49,1],[50,0,54,1],[1,5,2,16],[3,5,3,16],[76,15,79,15],[76,12,79,14],[78,5,78,11],[79,5,79,11],[78,16,78,18],[79,16,79,18],[25,15,29,15],[30,15,34,15],[35,15,39,15],[40,15,44,15],[45,15,49,15],[50,15,54,15],[55,15,59,15],[60,15,64,15],[20,15,20,16],[22,13,24,14],[15,0,15,5],[9,8,10,9],[65,15,69,15],[70,2,74,6],[75,0,75,18],[55,0,59,1],[22,15,24,15],[45,17,49,18],[50,17,54,18],[55,17,59,18],[60,17,64,18],[60,2,64,6],[60,7,64,12],[60,13,64,14],[35,2,39,6],[40,2,44,6],[45,2,49,6],[50,2,54,6],[25,17,29,18],[30,16,34,16],[25,16,29,16],[25,2,29,6],[55,13,59,14],[35,7,39,12],[40,7,44,12],[45,7,49,12],[50,7,54,12],[55,7,59,12],[35,16,39,16],[50,16,54,16],[30,2,34,6],[65,7,69,12],[76,16,77,18],[76,5,77,11],[45,16,49,16],[65,17,69,18],[65,0,69,1],[25,0,29,1],[30,0,34,1],[65,2,69,6],[70,15,74,15],[60,0,64,1],[35,17,39,18],[55,2,59,6],[40,16,44,16],[76,0,79,1],[76,2,79,4],[70,16,74,16]]}
[]
[null,null,null,null,null,"FORMATO 2. EVIDENCIAS\nSERVIDORES PÚBLICOS DE LIBRE NOMBRAMIENTO Y REMOCIÓN",null,null,null,null,null,null,null,null,null,null,null,"Código:   F-TH-70"]
[null,null,null,null,null,null,null,null,null,null,null,null,null,null,null,null,null,"Versión: 01"]
[null,null,null,null,null,"PROCESO: GESTIÓN DEL TALENTO HUMANO",null,null,null,null,null,null,null,null,null,null,null,"Página 1 de 1"]
["I. IDENTIFICACIÓN DEL EVALUADO"]
["Tipo de Documento",null,"Número de identificación",null,null,"Primer apellido",null,null,"Segundo apellido",null,null,"Primer nombre",null,null,null,"Otros nombres"]
["CEDULA DE CIUDADANIA",null,{"$f":"'F1. EVAL. LNR'!C8:E8","v":0},null,null,{"$f":"'F1. EVAL. LNR'!F8:H8","v":0},null,null,{"$f":"'F1. EVAL. LNR'!I8:K8","v":0},null,null,{"$f":"'F1. EVAL. LNR'!L8:M8","v":0},null,null,null,{"$f":"'F1. EVAL. LNR'!N8","v":0}]
["Dependencia o área a la que pertenece el evaluado",null,null,null,null,null,null,null,"Denominación del empleo"]
[{"$f":"'F1. EVAL. LNR'!A10:H10","v":0},null,null,null,null,null,null,null,{"$f":"'F1. EVAL. LNR'!I10:P10","v":0}]
["Nivel jerárquico",null,null,null,null,"Código",null,"Grado","Propósito del empleo:  ",null,{"$f":"'F1. EVAL. LNR'!K11","v":0}]
[{"$f":"'F1. EVAL. LNR'!A12:E12","v":0},null,null,null,null,{"$f":"'F1. EVAL. LNR'!F12:G12","v":0},null,{"$f":"'F1. EVAL. LNR'!H12","v":0}]
["II. IDENTIFICACIÓN EVALUADOR. (Jefe inmediato)"]
["Tipo de documento",null,"Número de identificación",null,null,"Primer apellido",null,null,"Segundo apellido",null,null,"Primer nombre",null,null,null,"Otros nombres"]
["CEDULA DE CIUDADANIA",null,{"$f":"'F1. EVAL. LNR'!C15:E15","v":0},null,null,{"$f":"'F1. EVAL. LNR'!F15:H15","v":0},null,null,{"$f":"'F1. EVAL. LNR'!I15:K15","v":0},null,null,{"$f":"'F1. EVAL. LNR'!L15:M15","v":0},null,null,null,{"$f":"'F1. EVAL. LNR'!N15:P15","v":0}]
[" Área o Dependencia a la que pertenece el evaluador",null,null,null,null,null,"Denominación del empleo",null,null,null,null,null,null,"Código",null,"Grado",null,"Nivel jerárquico"]
[{"$f":"'F1. EVAL. LNR'!A17:F17","v":0},null,null,null,null,null,{"$f":"'F1. EVAL. LNR'!G17:L17","v":0},null,null,null,null,null,null,{"$f":"'F1. EVAL. LNR'!M17:M17","v":0},null,{"$f":"'F1. EVAL. LNR'!N17:N17","v":0},null,{"$f":"'F1. EVAL. LNR'!O17:P17","v":{"$error":"#VALUE!"}}]
["III. IDENTIFICACIÓN EVALUADOR (Servidor público de Libre Nombramiento y Remoción en caso de constituir Comisión Evaluadora)"]
["Tipo de documento",null,"Número de identificación",null,null,"Primer apellido",null,null,"Segundo apellido",null,null,"Primer nombre",null,null,null,"Otros nombres"]
[{"$f":"#REF!","v":{"$error":"#REF!"}},null,{"$f":"IF(#REF!=\"NO\",\"NO REQUERIDO\",#REF!)","v":{"$error":"#REF!"}},null,null,{"$f":"IF(#REF!=\"NO\",\"NO REQUERIDO\",#REF!)","v":{"$error":"#REF!"}},null,null,{"$f":"IF(#REF!=\"NO\",\"NO REQUERIDO\",#REF!)","v":{"$error":"#REF!"}},null,null,{"$f":"IF(#REF!=\"NO\",\"NO REQUERIDO\",#REF!)","v":{"$error":"#REF!"}},null,null,null,{"$f":"IF(#REF!=\"NO\",\"NO REQUERIDO\",#REF!)","v":{"$error":"#REF!"}}]
["Dependencia o área a la que pertenece el evaluador",null,null,null,null,null,"Denominación del empleo",null,null,null,null,null,null,"Código",null,"Grado",null,"Nivel jerárquico"]
[{"$f":"IF(#REF!=\"NO\",\"NO REQUERIDO\",#REF!)","v":{"$error":"#REF!"}},null,null,null,null,null,{"$f":"IF(#REF!=\"NO\",\"NO REQUERIDO\",#REF!)","v":{"$error":"#REF!"}},null,null,null,null,null,null,{"$f":"IF(#REF!=\"NO\",\"NO REQUERIDO\",#REF!)","v":{"$error":"#REF!"}},null,{"$f":"IF(#REF!=\"NO\",\"NO REQUERIDO\",#REF!)","v":{"$error":"#REF!"}},null,{"$f":"IF(#REF!=\"NO\",\"NO REQUERIDO\",#REF!)","v":{"$error":"#REF!"}}]
["IV. EVIDENCIAS"]
["Componente de evaluación",null,"Compromisos y Competencias",null,null,null,null,"Descripción de la evidencia",null,null,null,null,null,"Ubicación de la evidencia.",null,"Fecha de Inclusión de la evidencia","Observaciones","Evidencia Aportada por"]
[]
[]
[null,null,{"$f":"VLOOKUP(A26,Hoja4!A$467:B$482,2,FALSE)","v":{"$error":"#N/A"}}]
[]
[]
[]
[]
[null,null,{"$f":"VLOOKUP(A31,Hoja4!A$467:B$482,2,FALSE)","v":{"$error":"#N/A"}}]
[]
[]
[]
[]
[null,null,{"$f":"VLOOKUP(A36,Hoja4!A$467:B$482,2,FALSE)","v":{"$error":"#N/A"}}]
[]
[]
[]
[]
{"$rows_left_out":41}
{"sheet":"Hoja4","index":2,"n_rows":1199,"n_cols":34,"rows_kept":1199,"cut":false,"hidden":true,"merged":[[489,0,489,1],[501,0,501,1],[106,25,131,25],[28,25,53,25],[54,25,79,25],[80,25,105,25],[132,25,157,25],[454,8,454,9],[455,8,455,9],[158,25,183,25],[184,25,209,25],[454,10,454,11],[452,10,452,11],[453,10,453,11],[452,8,452,9],[453,8,453,9],[17,17,18,17],[19,17,21,17],[22,17,24,17],[450,10,450,11],[451,10,451,11],[447,7,449,7],[447,10,449,11],[447,8,449,9],[457,10,457,11],[456,8,456,9],[457,8,457,9],[455,10,455,11],[450,8,450,9],[451,8,451,9],[456,10,456,11]]}
[null,null,null,null,null,null,null,null,null,null,null,null,null,0]
["CODIGO",null,"DIRECTIVO",null,null,null,null,null,null,null,null,null,null,1,null,"2016-01-01",null,null,"SI",0.01,"NO SATISFACTORIO",null,null,null,null,"UNO"]
[1050,null,"ASESOR","MODIFICA LA CALIFICACIÓN",1,6,null,1,null,2016,null,65,null,2,null,"2016-01-02",null,null,"NO",0.02,"NO SATISFACTORIO",null,null,null,"CEDULA DE CIUDADANIA","UNO",1,"NO SATISFACTORIO"]
[1020,null,"PROFESIONAL","CONFIRMA LA CALIFICACIÓN",2,9,"X",2,null,2017,null,76,null,3,null,"2016-01-03",null,null,null,0.03,"NO SATISFACTORIO",null,null,null,null,"UNO",1.1000000000000001,"NO SATISFACTORIO"]
[1060,null,"TECNICO","RECHAZA POR EXTEMPORÁNEA",3,12,null,3,null,2018,null,null,null,4,null,"2016-01-04",null,null,null,0.04,"NO SATISFACTORIO",null,null,null,null,"UNO",1.2,"NO SATISFACTORIO"]
[1045,null,"ASISTENCIAL",null,4,15,null,4,null,2019,null,null,null,5,null,"2016-01-05",null,null,null,0.05,"NO SATISFACTORIO",null,null,null,null,"UNO",1.3,"NO SATISFACTORIO"]
[2025,null,null,null,5,4,null,5,null,2020,null,null,null,6,null,"2016-01-06",null,null,null,0.06,"NO SATISFACTORIO",null,null,null,null,"UNO",1.4,"NO SATISFACTORIO"]
[2001,null,null,null,6,6,null,6,null,2021,null,null,null,7,null,"2016-01-07",null,null,null,7.0000000000000007E-2,"NO SATISFACTORIO",null,null,null,"EVALUADO","UNO",1.5,"NO SATISFACTORIO"]
[2132,null,"CEDULA DE CIUDADANIA",null,7,8,null,7,null,2022,null,null,null,8,null,"2016-01-08",null,null,null,0.08,"NO SATISFACTORIO",null,null,null,"EVALUADOR","UNO",1.6,"NO SATISFACTORIO"]
[2133,null,"CEDULA DE EXTRAJERIA",null,8,10,null,8,null,2023,null,null,null,9,null,"2016-01-09",null,null,null,0.09,"NO SATISFACTORIO",1,1,null,"TERCERO","UNO",1.7,"NO SATISFACTORIO"]
[2002,null,null,null,9,null,null,9,null,2024,null,null,null,10,null,"2016-01-10",null,null,null,0.1,"NO SATISFACTORIO",2,2,null,null,"UNO",1.8,"NO SATISFACTORIO"]
[2125,null,null,null,10,null,null,10,null,2025,null,null,null,11,null,"2016-01-11",null,null,null,0.11,"NO SATISFACTORIO",3,3,null,null,"UNO",1.9,"NO SATISFACTORIO"]
[2137,null,null,null,11,null,null,11,null,2026,null,null,null,12,null,"2016-01-12",null,null,null,0.12,"NO SATISFACTORIO",4,4,null,null,"UNO",2,"NO SATISFACTORIO"]
[2012,null,null,null,12,null,null,12,null,2027,null,null,null,13,null,"2016-01-13",null,null,null,0.13,"NO SATISFACTORIO",null,5,null,null,"UNO",2.1,"NO SATISFACTORIO"]
[2014,null,"SI",null,13,null,null,13,null,2028,null,null,null,14,null,"2016-01-14",null,null,null,0.14000000000000001,"NO SATISFACTORIO",null,6,null,null,"UNO",2.2000000000000002,"NO SATISFACTORIO"]
[2018,null,"NO",null,14,null,null,14,null,2029,null,null,null,15,null,"2016-01-15",null,null,null,0.15,"NO SATISFACTORIO",null,7,null,null,"UNO",2.2999999999999998,"NO SATISFACTORIO"]
[2003,null,null,null,15,null,null,15,null,2030,null,null,null,16,null,"2016-01-16",null,null,null,0.16,null,null,8,null,null,"UNO",15,"NO SATISFACTORIO"]
[2004,null,null,null,16,null,null,16,null,2031,null,null,null,17,null,"2016-01-17",null,"CONOCIMIENTO DEL ENTORNO",null,0.16,"NO SATISFACTORIO",5,9,null,null,"UNO",2.4,"NO SATISFACTORIO"]
[2085,null,null,null,17,null,null,17,null,2032,null,null,null,18,null,"2016-01-18",null,null,null,0.17,"NO SATISFACTORIO",5.9589041095890396,10,null,null,"UNO",2.5,"NO SATISFACTORIO"]
[2120,null,null,null,18,null,null,18,null,2033,null,null,null,19,null,"2016-01-19",null,"CONSTRUCCIÓN DE RELACIONES",null,0.18,"NO SATISFACTORIO",6.5068493150685001,11,null,null,"UNO",2.6,"NO SATISFACTORIO"]
[2142,null,null,null,19,null,null,19,null,2034,null,null,null,20,null,"2016-01-20",null,null,null,0.19,"NO SATISFACTORIO",7.0547945205479401,12,null,null,"UNO",2.7,"NO SATISFACTORIO"]
[2087,null,null,null,20,null,null,20,null,2035,null,null,null,21,null,"2016-01-21",null,null,null,0.2,"NO SATISFACTORIO",7.6027397260273899,13,null,null,"UNO",2.8,"NO SATISFACTORIO"]
[2123,null,null,null,21,null,null,21,null,2036,null,null,null,22,null,"2016-01-22",null,"INICIATIVA",null,0.21,"NO SATISFACTORIO",8.1506849315068504,14,null,null,"UNO",2.9,"NO SATISFACTORIO"]
[2052,null,null,null,22,null,null,22,null,2037,null,null,null,23,null,"2016-01-23",null,null,null,0.22,"NO SATISFACTORIO",8.6986301369862993,15,null,null,"UNO",3,"NO SATISFACTORIO"]
[2009,null,null,null,23,null,null,23,null,2038,null,null,null,24,null,"2016-01-24",null,null,null,0.23,"NO SATISFACTORIO",9.24657534246575,16,null,null,"UNO",3.1,"NO SATISFACTORIO"]
[2007,null,null,null,24,null,null,24,null,2039,null,65,null,25,null,"2016-01-25",null,null,null,0.24,"NO SATISFACTORIO",9.7945205479452007,17,null,null,"UNO",3.2,"NO SATISFACTORIO"]
[2112,null,null,null,25,null,null,25,null,2040,null,76,null,26,null,"2016-01-26",null,null,null,0.25,"NO SATISFACTORIO",10.342465753424699,18,null,null,"UNO",3.3,"NO SATISFACTORIO"]
[2165,null,null,null,26,null,null,26,null,2042,null,80,null,27,null,"2016-01-27",null,null,null,0.26,"NO SATISFACTORIO",10.8904109589041,19,null,null,"UNO",3.3,"NO SATISFACTORIO"]
[2028,null,null,null,27,null,null,27,null,2043,null,85,null,28,null,"2016-01-28",null,null,null,0.27,"NO SATISFACTORIO",11.438356164383601,20,null,null,"DOS",3.4,"NO SATISFACTORIO"]
[2033,null,null,null,null,null,null,28,null,2044,null,90,null,29,null,"2016-01-29",null,null,null,0.28000000000000003,"NO SATISFACTORIO",11.986301369863,21,null,null,null,3.5,"NO SATISFACTORIO"]
[2044,null,null,null,null,null,null,29,null,2045,null,95,null,30,null,"2016-01-30",null,null,null,0.28999999999999998,"NO SATISFACTORIO",12.534246575342401,22,null,null,null,3.6,"NO SATISFACTORIO"]
[2048,null,null,null,null,null,null,30,null,2046,null,100,null,31,null,"2016-01-31",null,null,null,0.3,"NO SATISFACTORIO",13.082191780821899,23,null,null,null,3.7,"NO SATISFACTORIO"]
[2152,null,null,null,null,null,null,31,null,2047,null,null,null,32,null,"2016-02-01",null,null,null,0.31,"NO SATISFACTORIO",13.6301369863013,24,null,null,null,3.8,"NO SATISFACTORIO"]
[2184,null,null,null,null,null,null,null,null,2048,null,null,null,33,null,"2016-02-02",null,null,null,0.32,"NO SATISFACTORIO",14.178082191780801,25,null,null,null,3.9,"NO SATISFACTORIO"]
[2094,null,null,null,null,null,null,null,null,2049,null,null,null,34,null,"2016-02-03",null,null,null,0.33,"NO SATISFACTORIO",14.7260273972603,26,null,null,null,4,"NO SATISFACTORIO"]
[2186,null,null,null,null,null,null,null,null,2050,null,null,null,35,null,"2016-02-04",null,null,null,0.34,"NO SATISFACTORIO",15.2739726027397,27,null,null,null,4.0999999999999996,"NO SATISFACTORIO"]
[2102,null,null,null,null,null,null,null,null,null,null,null,null,36,null,"2016-02-05",null,null,null,0.35,"NO SATISFACTORIO",15.821917808219199,28,null,null,null,4.2,"NO SATISFACTORIO"]
[2103,null,null,null,null,null,null,null,null,null,null,null,null,37,null,"2016-02-06",null,null,null,0.36,"NO SATISFACTORIO",16.369863013698598,29,null,null,null,4.3,"NO SATISFACTORIO"]
[2114,null,null,null,null,null,null,null,null,null,null,null,null,38,null,"2016-02-07",null,null,null,0.37,"NO SATISFACTORIO",16.917808219178099,30,null,null,null,4.4000000000000004,"NO SATISFACTORIO"]
[2147,null,null,null,null,null,null,null,null,null,null,null,null,39,null,"2016-02-08",null,null,null,0.38,"NO SATISFACTORIO",17.4657534246575,31,null,null,null,4.5,"NO SATISFACTORIO"]
{"$rows_left_out":1159}